facility_id,chart_id,period,ethnicity,payor,section,substances_exposed,was_breastfed,was_discharged_transferred,was_mothers_milk_discharge,was_followup_scheduled,was_safe_care_plan_offered,was_safe_care_plan_accepted,was_discharge_biological_mother,was_nas_risk,was_nas_diagnosed,infant_care_method,was_treatment_required,was_other_medication_used,was_scheduled_dosing_used,was_rescue_dose_used,was_discharged_home_supporting_meds,length_of_stay
Test Facility,21,2020-11,white,bcbs_state,newborn,morphine,1,discharged,1,1,1,1,1,1,0,finnegan,1,1,,1,1,4
Test Facility,22,2020-11,black,bcbs_state,newborn,morphine,1,discharged,1,1,1,1,1,1,0,finnegan,1,0,,0,1,4
Test Facility,23,2020-11,black,bcbs_state,newborn,morphine,1,discharged,1,1,1,1,1,1,1,finnegan,1,0,,0,1,4
Test Facility,24,2020-11,black,bcbs_state,newborn,morphine,1,discharged,1,1,1,1,1,1,1,finnegan,1,0,,0,1,4
Test Facility,25,2020-11,black,bcbs_state,newborn,morphine,1,discharged,1,1,1,1,1,1,1,finnegan,1,0,,0,1,4
Test Facility,26,2020-11,white,bcbs_state,newborn,morphine,1,discharged,1,1,1,1,1,1,1,finnegan,1,0,,0,0,4
Test Facility,27,2020-11,white,bcbs_state,newborn,morphine,1,discharged,1,1,1,1,1,1,1,finnegan,1,0,,0,0,4
Test Facility,28,2020-11,white,bcbs_state,newborn,morphine,1,discharged,1,1,1,1,1,1,1,finnegan,1,0,,0,0,4
Test Facility,29,2020-11,white,bcbs_state,newborn,morphine,1,discharged,1,1,1,1,1,1,1,finnegan,1,0,,0,0,4
Test Facility,30,2020-11,white,bcbs_state,newborn,morphine,1,discharged,1,1,1,1,1,1,1,finnegan,1,0,,0,0,4
Test Facility,31,2020-11,white,medicaid,newborn,morphine,0,discharged,1,0,1,1,1,1,1,esc,1,0,1,,,2
Test Facility,32,2020-11,white,medicaid,newborn,morphine,0,discharged,1,0,1,0,1,1,1,esc,0,,,,,2
Test Facility,33,2020-11,white,medicaid,newborn,morphine,0,discharged,0,0,1,0,1,1,1,esc,0,,,,,2
Test Facility,34,2020-11,white,medicaid,newborn,morphine,0,discharged,0,0,1,0,1,1,1,esc,0,,,,,2
Test Facility,35,2020-11,white,medicaid,newborn,morphine,0,discharged,0,0,1,0,1,1,1,esc,0,,,,,2
Test Facility,36,2020-11,hispanic,medicaid,newborn,morphine,0,discharged,0,0,1,0,1,1,1,esc,0,,,,,2
Test Facility,37,2020-11,hispanic,medicaid,newborn,other_opiates,0,discharged,0,0,1,0,1,1,1,esc,0,,,,,2
Test Facility,38,2020-11,refused,medicaid,newborn,other_opiates,0,discharged,0,0,1,0,1,1,1,esc,0,,,,,2
Test Facility,39,2020-11,refused,medicaid,newborn,other_opiates,0,discharged,0,0,0,0,0,1,1,esc,0,,,,,2
Test Facility,40,2020-11,multiracial,medicaid,newborn,other_opiates,0,discharged,0,0,0,0,0,1,1,esc,0,,,,,2
